{"text_format":"1","workbook":"xlsx","n_sheets":9,"sheets":["Foglio1","Foglio2","Foglio3","Foglio4","Foglio5","Foglio5bis","Foglio6","Foglio7","Legenda"],"not_rendered":{"charts":0,"images":0,"macros":1,"external_links":1,"defined_names":1,"comments":0,"pivot_tables":0},"unopened":[],"bounds":{"document_bytes":16777216,"sheet_cells":100000,"rows_first":2000,"rows_last":500,"rows_between":2000,"halvings":0,"cell_chars":16384,"cell_head_chars":4096},"cells_cut":0,"cells_raw":0,"read":"whole","date_system":"1900"}

{"sheet":"Foglio1","index":0,"n_rows":44,"n_cols":14,"rows_kept":44,"cut":false,"hidden":false,"merged":[[24,11,24,13],[25,11,25,13],[26,11,26,13],[27,11,27,13],[16,7,16,13],[22,11,22,13],[23,11,23,13],[17,11,17,13],[18,11,18,13],[19,11,19,13],[20,11,20,13],[21,11,21,13],[40,6,40,7],[40,9,40,10],[44,2,44,4],[38,6,38,7],[38,9,38,10],[39,6,39,7],[39,9,39,10],[44,6,44,12],[36,8,36,9],[36,11,36,12],[30,0,30,2],[35,11,35,12],[35,8,35,9],[30,4,31,4],[30,3,31,3],[30,5,31,13],[0,0,9,13],[13,0,13,3],[14,0,14,3],[11,4,11,6],[12,4,12,6],[13,4,13,9],[14,4,14,9],[12,8,12,9],[11,0,11,3],[12,0,12,3]]}
["INTESTAZIONE/LOGO DITTA"]
[]
[]
[]
[]
[]
[]
[]
[]
[]
[]
["Luogo"]
["Prot. :",null,null,null,null,null,null,"data:"]
["Seguito:"]
["Rif.:"]
[]
[null,null,null,null,null,null,null,"A: Ministero degli Affari Esteri e della Cooperazione Internazionale"]
[null,null,null,null,null,null,null,null,null,null,null,"Autorità nazionale - U.A.M.A."]
[null,null,null,null,null,null,null,null,null,null,null,"Divisione Trattative Contrattuali"]
[null,null,null,null,null,null,null,null,null,null,null,"Piazzale della Farnesina, 1"]
{"$rows_left_out":25}
{"sheet":"Foglio2","index":1,"n_rows":54,"n_cols":12,"rows_kept":54,"cut":false,"hidden":false,"merged":[[3,0,3,1],[3,2,3,5],[45,9,48,11],[45,1,48,4],[19,1,19,2],[23,1,23,2],[17,6,17,11],[25,3,25,4],[19,4,19,11],[21,4,21,6],[21,8,21,11],[23,4,23,11],[10,1,10,4],[10,5,10,8],[10,11,10,12],[36,10,36,11],[9,2,9,10],[28,1,28,12],[42,6,42,11],[51,7,51,11],[49,9,49,11],[40,6,40,11],[38,6,38,7],[38,10,38,11],[36,6,36,7],[11,1,11,3],[11,4,11,12],[12,1,12,12],[21,1,21,2],[13,1,13,12]]}
[]
[]
[]
[" Protocollo",null,{"$f":"IF(Foglio1!E13=\"\",\"\",Foglio1!E13)","v":""},null,null,null,null,null,null,{"$f":"IF(Foglio1!H13=\"\",\"\",Foglio1!H13)","v":"data:"},{"$f":"IF(Foglio1!I13=\"\",\"\",Foglio1!I13)","v":""}]
[]
[]
[]
[]
[]
[null,null,"Questa Società, iscritta al Registro Nazionale delle Imprese con estremi  ",null,null,null,null,null,null,null,null,"N.00000"]
[null,"in possesso di abilitazione n.",null,null,null,"0.0000000.0000",null,null,null,"in data","1970-01-01","fino al livello di"]
[null,"SEGRETISSIMO",null,null," concessa dall'Autorità nazionale per la Sicurezza, in corso di validità, chiede di essere"]
[null,"autorizzata a trattare ovvero comunica di aver iniziato trattative contrattuali a livello di classifica corrispondente a "]
[null,"quello oggetto della trattativa con:"]
[]
[null,"CONTRAENTE:"]
[]
[null,null,"Paese",null,{"$f":"IFERROR(VLOOKUP(G18,Legenda!I18:'Legenda'!J204,2,1),\"\")","v":""}]
[null,"Ragione sociale/Denominazione"]
[null,"(CONTRAENTE)"]
{"$rows_left_out":35}
{"sheet":"Foglio3","index":2,"n_rows":47,"n_cols":8,"rows_kept":47,"cut":false,"hidden":false,"merged":[[16,1,16,2],[17,1,17,5],[12,1,12,2],[13,1,13,6],[14,1,14,2],[15,1,15,5],[11,1,11,8],[3,0,3,1],[3,2,3,3],[8,2,8,6],[19,1,19,3],[20,1,20,2],[38,1,41,2],[18,1,18,2],[38,7,41,9]]}
[]
[]
[]
[" Protocollo",null,{"$f":"IF(Foglio1!E13=\"\",\"\",Foglio1!E13)","v":""},null,null,null,"data",{"$f":"IF(Foglio1!I13=\"\",\"\",Foglio1!I13)","v":""}]
[]
[]
[]
[]
[null,null,"ELENCO INDIRIZZI ALLEGATO"]
[]
[]
[null,"Ministero della Difesa - Segretariato Generale della Difesa e Direzione Nazionale degli Armamenti  - II Reparto"]
[null,"sgd@postacert.difesa.it"]
[null,"Stato Maggiore dell'Esercito - IV Reparto"]
[null,"statesercito@postacert.difesa.it"]
[null,"Stato Maggiore della Marina - III Reparto"]
[null,"maristat@postacert.difesa.it"]
[null,"Stato Maggiore dell'Aeronautica - IV Reparto"]
[null,"stataereo@postacert.difesa.it"]
[null,"Agenzia Informazioni e Sicurezza Esterna - AISE"]
{"$rows_left_out":28}
{"sheet":"Foglio4","index":3,"n_rows":59,"n_cols":13,"rows_kept":59,"cut":false,"hidden":false,"merged":[[27,8,28,12],[1,0,1,3],[55,0,55,3],[55,4,55,6],[51,1,54,5],[3,0,3,12],[4,0,4,12],[6,0,6,12],[1,4,1,7],[15,7,15,9],[12,7,12,12],[17,7,17,12],[25,8,25,11],[40,8,40,11],[10,8,10,11],[51,10,54,12],[46,8,46,12],[44,8,44,10],[42,8,42,11],[30,7,30,10],[32,7,33,12]]}
[]
[" Protocollo",null,null,null,{"$f":"IF(Foglio1!E13=\"\",\"\",Foglio1!E13)","v":""},null,null,null,null,null,null,"data",{"$f":"IF(Foglio1!I13=\"\",\"\",Foglio1!I13)","v":""}]
[]
["ELEMENTI PRINCIPALI / ELENCO MATERIALI"]
["Allegato 1"]
[]
["Soggetti dell'operazione"]
[]
[null,"DESTINATARIO/MITTENTE:"]
[]
[null,null,null,null,null,"Paese",{"$f":"IFERROR(VLOOKUP(I11,Legenda!I18:'Legenda'!J204,2,1),\"\")","v":""}]
[]
[null,null,"Ragione sociale/Denominazione"]
[]
[]
[null,null,null,null,null,"Città",null,null,null,null,null,"CAP"]
[]
[null,null,null,null,null,"Indirizzo"]
[]
[]
{"$rows_left_out":40}
{"sheet":"Foglio5","index":4,"n_rows":54,"n_cols":26,"rows_kept":54,"cut":false,"hidden":false,"merged":[[1,0,1,2],[1,3,1,10],[1,19,1,20],[1,21,1,25],[2,1,2,25],[4,2,4,5],[4,6,4,25],[7,24,7,25],[8,1,8,2],[10,2,10,5],[10,6,10,25],[11,1,12,1],[11,2,12,5],[11,6,11,25],[12,6,12,25],[5,1,6,1],[5,2,6,5],[5,6,5,25],[6,6,6,25],[7,1,7,2],[7,3,7,4],[7,5,7,6],[7,7,7,8],[7,9,7,13],[7,16,7,23],[13,24,13,25],[14,1,14,2],[16,2,16,5],[16,6,16,25],[17,1,18,1],[17,2,18,5],[17,6,17,25],[18,6,18,25],[13,1,13,2],[13,3,13,4],[13,5,13,6],[13,7,13,8],[13,9,13,13],[13,16,13,23],[19,24,19,25],[20,1,20,2],[22,2,22,5],[22,6,22,25],[23,1,24,1],[23,2,24,5],[23,6,23,25],[24,6,24,25],[19,1,19,2],[19,3,19,4],[19,5,19,6],[19,7,19,8],[19,9,19,13],[19,16,19,23],[25,24,25,25],[26,1,26,2],[28,2,28,5],[28,6,28,25],[29,1,30,1],[29,2,30,5],[29,6,29,25],[30,6,30,25],[25,1,25,2],[25,3,25,4],[25,5,25,6],[25,7,25,8],[25,9,25,13],[25,16,25,23],[31,24,31,25],[32,1,32,2],[34,2,34,5],[34,6,34,25],[35,1,36,1],[35,2,36,5],[35,6,35,25],[36,6,36,25],[31,1,31,2],[31,3,31,4],[31,5,31,6],[31,7,31,8],[31,9,31,13],[31,16,31,23],[37,24,37,25],[38,1,38,2],[40,2,40,5],[40,6,40,25],[41,1,42,1],[41,2,42,5],[41,6,41,25],[42,6,42,25],[37,1,37,2],[37,3,37,4],[37,5,37,6],[37,7,37,8],[37,9,37,13],[37,16,37,23],[43,24,43,25],[44,1,44,2],[46,1,49,7],[46,15,49,22],[49,13,49,14],[50,1,50,2],[50,3,50,10],[50,13,50,14],[43,1,43,2],[43,3,43,4],[43,5,43,6],[43,7,43,8],[43,9,43,13],[43,16,43,23]]}
[]
[" Protocollo",null,null,{"$f":"IF(Foglio1!E13=\"\",\"\",Foglio1!E13)","v":""},null,null,null,null,null,null,null,null,null,null,null,null,null,null,null,"Data",null,{"$f":"IF(Foglio1!I13=\"\",\"\",Foglio1!I13)","v":""}]
[null,"Materiali"]
[]
[null,{"$f":"(7*(_xlfn.SHEET()-5)+1)","v":1},"tipo materiale",null,null,null,"denominazione materiale"]
[]
[]
[null,"Classifica",null,"Cat.",null,"Gr.",null,"Sot.",null,"codice RNI",null,null,null,null,"q.tà","U.M.","voce doganale",null,null,null,null,null,null,null,"TARIC"]
[null,null,null,{"$f":"INDEX('[1]Lista Materiali'!$A$6:G39994,MATCH(1,('[1]Lista Materiali'!$A$6:'[1]Lista Materiali'!$A$40000=G6)*('[1]Lista Materiali'!$B$6:'[1]Lista Materiali'!$B$40000=(RIGHT(B9,2)))*('[1]Lista Materiali'!$C$6:'[1]Lista Materiali'!$C$40000=(LEFT(C6,1))),0),4)","v":{"$error":"#REF!"}},null,{"$f":"INDEX('[1]Lista Materiali'!$A$6:G39994,MATCH(1,('[1]Lista Materiali'!$A$6:'[1]Lista Materiali'!$A$40000=G6)*('[1]Lista Materiali'!$B$6:'[1]Lista Materiali'!$B$40000=(RIGHT(B9,2)))*('[1]Lista Materiali'!$C$6:'[1]Lista Materiali'!$C$40000=(LEFT(C6,1))),0),5)","v":{"$error":"#REF!"}},null,{"$f":"INDEX('[1]Lista Materiali'!$A$6:G39994,MATCH(1,('[1]Lista Materiali'!$A$6:'[1]Lista Materiali'!$A$40000=G6)*('[1]Lista Materiali'!$B$6:'[1]Lista Materiali'!$B$40000=(RIGHT(B9,2)))*('[1]Lista Materiali'!$C$6:'[1]Lista Materiali'!$C$40000=(LEFT(C6,1))),0),6)","v":{"$error":"#REF!"}},null,null,null,{"$f":"INDEX('[1]Lista Materiali'!$A$6:G39994,MATCH(1,('[1]Lista Materiali'!$A$6:'[1]Lista Materiali'!$A$40000=G6)*('[1]Lista Materiali'!$B$6:'[1]Lista Materiali'!$B$40000=(RIGHT(B9,2)))*('[1]Lista Materiali'!$C$6:'[1]Lista Materiali'!$C$40000=(LEFT(C6,1))),0),7)","v":{"$error":"#REF!"}},null,null,null,null,1,2,3,4,5,6,7,8,9,0]
[]
[null,{"$f":"(7*(_xlfn.SHEET()-5)+2)","v":2},"tipo materiale",null,null,null,"denominazione materiale"]
[]
[]
[null,"Classifica",null,"Cat.",null,"Gr.",null,"Sot.",null,"codice RNI",null,null,null,null,"q.tà","U.M.","voce doganale",null,null,null,null,null,null,null,"TARIC"]
[null,null,null,{"$f":"INDEX('[1]Lista Materiali'!$A$6:G40000,MATCH(1,('[1]Lista Materiali'!$A$6:'[1]Lista Materiali'!$A$40000=G12)*('[1]Lista Materiali'!$B$6:'[1]Lista Materiali'!$B$40000=(RIGHT(B15,2)))*('[1]Lista Materiali'!$C$6:'[1]Lista Materiali'!$C$40000=(LEFT(C12,1))),0),4)","v":{"$error":"#REF!"}},null,{"$f":"INDEX('[1]Lista Materiali'!$A$6:G40000,MATCH(1,('[1]Lista Materiali'!$A$6:'[1]Lista Materiali'!$A$40000=G12)*('[1]Lista Materiali'!$B$6:'[1]Lista Materiali'!$B$40000=(RIGHT(B15,2)))*('[1]Lista Materiali'!$C$6:'[1]Lista Materiali'!$C$40000=(LEFT(C12,1))),0),5)","v":{"$error":"#REF!"}},null,{"$f":"INDEX('[1]Lista Materiali'!$A$6:G40000,MATCH(1,('[1]Lista Materiali'!$A$6:'[1]Lista Materiali'!$A$40000=G12)*('[1]Lista Materiali'!$B$6:'[1]Lista Materiali'!$B$40000=(RIGHT(B15,2)))*('[1]Lista Materiali'!$C$6:'[1]Lista Materiali'!$C$40000=(LEFT(C12,1))),0),6)","v":{"$error":"#REF!"}},null,null,null,{"$f":"INDEX('[1]Lista Materiali'!$A$6:G40000,MATCH(1,('[1]Lista Materiali'!$A$6:'[1]Lista Materiali'!$A$40000=G12)*('[1]Lista Materiali'!$B$6:'[1]Lista Materiali'!$B$40000=(RIGHT(B15,2)))*('[1]Lista Materiali'!$C$6:'[1]Lista Materiali'!$C$40000=(LEFT(C12,1))),0),7)","v":{"$error":"#REF!"}}]
[]
[null,{"$f":"(7*(_xlfn.SHEET()-5)+3)","v":3},"tipo materiale",null,null,null,"denominazione materiale"]
[]
[]
[null,"Classifica",null,"Cat.",null,"Gr.",null,"Sot.",null,"codice RNI",null,null,null,null,"q.tà","U.M.","voce doganale",null,null,null,null,null,null,null,"TARIC"]
{"$rows_left_out":35}
{"sheet":"Foglio5bis","index":5,"n_rows":54,"n_cols":26,"rows_kept":54,"cut":false,"hidden":false,"merged":[[44,9,44,13],[40,2,40,5],[40,6,40,25],[23,6,23,25],[25,1,25,2],[25,3,25,4],[25,5,25,6],[25,7,25,8],[35,1,36,1],[36,6,36,25],[23,1,24,1],[24,6,24,25],[34,6,34,25],[25,9,25,13],[25,16,25,23],[29,6,29,25],[29,1,30,1],[30,6,30,25],[37,24,37,25],[35,6,35,25],[1,19,1,20],[1,0,1,2],[1,3,1,10],[7,1,7,2],[7,16,7,23],[1,21,1,25],[6,6,6,25],[5,1,6,1],[7,3,7,4],[7,5,7,6],[7,7,7,8],[7,9,7,13],[10,2,10,5],[10,6,10,25],[16,2,16,5],[16,6,16,25],[13,1,13,2],[13,3,13,4],[13,5,13,6],[13,7,13,8],[13,9,13,13],[11,6,11,25],[14,9,14,13],[13,24,13,25],[17,1,18,1],[19,24,19,25],[42,6,42,25],[43,1,43,2],[43,3,43,4],[43,5,43,6],[17,6,17,25],[18,6,18,25],[11,1,12,1],[12,6,12,25],[19,1,19,2],[19,3,19,4],[19,5,19,6],[19,7,19,8],[19,9,19,13],[38,9,38,13],[41,6,41,25],[34,2,34,5],[19,16,19,23],[25,24,25,25],[28,2,28,5],[28,6,28,25],[22,2,22,5],[22,6,22,25],[20,9,20,13],[26,9,26,13],[32,9,32,13],[31,24,31,25],[31,1,31,2],[31,3,31,4],[31,5,31,6],[31,7,31,8],[31,9,31,13],[31,16,31,23],[50,13,50,14],[4,2,4,5],[2,1,2,25],[7,24,7,25],[4,6,4,25],[5,6,5,25],[46,1,49,7],[50,1,50,2],[50,3,50,10],[46,15,49,22],[49,13,49,14],[43,9,43,13],[37,9,37,13],[37,1,37,2],[37,3,37,4],[37,5,37,6],[37,7,37,8],[41,1,42,1],[8,9,8,13],[13,16,13,23],[43,7,43,8],[43,16,43,23],[37,16,37,23],[43,24,43,25]]}
[]
[" Protocollo",null,null,{"$f":"IF(Foglio1!E13=\"\",\"\",Foglio1!E13)","v":""},null,null,null,null,null,null,null,null,null,null,null,null,null,null,null,"Data",null,{"$f":"IF(Foglio1!I13=\"\",\"\",Foglio1!I13)","v":""}]
[null,"Materiali"]
[]
[null,{"$f":"(7*(_xlfn.SHEET()-6)+1)","v":1},"tipo materiale",null,null,null,"denominazione materiale"]
[null,null,null,{"$f":"IF(J9=0,\"\",INDEX(Legenda!B112:B115,INDEX('[1]Lista Materiali'!A6:G50000,MATCH(J9,'[1]Lista Materiali'!$G$6:G50000,0),3)))","v":""},null,null,{"$f":"IF(J9=0,\"\",INDEX('[1]Lista Materiali'!A6:G50000,MATCH(J9,'[1]Lista Materiali'!$G$6:G50000,0),1))","v":""}]
[]
[null,"Classifica",null,"Cat.",null,"Gr.",null,"Sot.",null,"codice RNI",null,null,null,null,"q.tà","U.M.","voce doganale",null,null,null,null,null,null,null,"TARIC"]
[null,null,{"$f":"IF(J9=0,\"\",VLOOKUP(INDEX('[1]Lista Materiali'!A6:G50000,MATCH(J9,'[1]Lista Materiali'!$G$6:G50000,0),2),Legenda!C117:D121,2))","v":""},null,{"$f":"IF(J9=0,\"\",INDEX('[1]Lista Materiali'!A6:G50000,MATCH(J9,'[1]Lista Materiali'!$G$6:G50000,0),4))","v":""},null,{"$f":"IF(J9=0,\"\",INDEX('[1]Lista Materiali'!A6:G50000,MATCH(J9,'[1]Lista Materiali'!$G$6:G50000,0),5))","v":""},null,{"$f":"IF(J9=0,\"\",INDEX('[1]Lista Materiali'!A6:G50000,MATCH(J9,'[1]Lista Materiali'!$G$6:G50000,0),6))","v":""},null,null,null,null,null,null,null,1,2,3,4,5,6,7,8,9,0]
[]
[null,{"$f":"(7*(_xlfn.SHEET()-6)+2)","v":2},"tipo materiale",null,null,null,"denominazione materiale"]
[null,null,null,{"$f":"IF(J15=0,\"\",INDEX(Legenda!B112:B115,INDEX('[1]Lista Materiali'!A6:G50000,MATCH(J15,'[1]Lista Materiali'!$G$6:G50000,0),3)))","v":""},null,null,{"$f":"IF(J15=0,\"\",INDEX('[1]Lista Materiali'!A6:G50000,MATCH(J15,'[1]Lista Materiali'!$G$6:G50000,0),1))","v":""}]
[]
[null,"Classifica",null,"Cat.",null,"Gr.",null,"Sot.",null,"codice RNI",null,null,null,null,"q.tà","U.M.","voce doganale",null,null,null,null,null,null,null,"TARIC"]
[null,null,{"$f":"IF(J15=0,\"\",VLOOKUP(INDEX('[1]Lista Materiali'!A6:G50000,MATCH(J15,'[1]Lista Materiali'!$G$6:G50006,0),2),Legenda!C117:D121,2))","v":""},null,{"$f":"IF(J15=0,\"\",INDEX('[1]Lista Materiali'!A6:G50000,MATCH(J15,'[1]Lista Materiali'!$G$6:G50000,0),4))","v":""},null,{"$f":"IF(J15=0,\"\",INDEX('[1]Lista Materiali'!A6:G50000,MATCH(J15,'[1]Lista Materiali'!$G$6:G50000,0),5))","v":""},null,{"$f":"IF(J15=0,\"\",INDEX('[1]Lista Materiali'!A6:G50000,MATCH(J15,'[1]Lista Materiali'!$G$6:G50000,0),6))","v":""}]
[]
[null,{"$f":"(7*(_xlfn.SHEET()-6)+3)","v":3},"tipo materiale",null,null,null,"denominazione materiale"]
[null,null,null,{"$f":"IF(J21=0,\"\",INDEX(Legenda!B112:B115,INDEX('[1]Lista Materiali'!A6:G50000,MATCH(J21,'[1]Lista Materiali'!$G$6:G50000,0),3)))","v":""},null,null,{"$f":"IF(J21=0,\"\",INDEX('[1]Lista Materiali'!A6:G50000,MATCH(J21,'[1]Lista Materiali'!$G$6:G50000,0),1))","v":""}]
[]
[null,"Classifica",null,"Cat.",null,"Gr.",null,"Sot.",null,"codice RNI",null,null,null,null,"q.tà","U.M.","voce doganale",null,null,null,null,null,null,null,"TARIC"]
{"$rows_left_out":35}
{"sheet":"Foglio6","index":6,"n_rows":52,"n_cols":21,"rows_kept":52,"cut":false,"hidden":false,"merged":[[45,11,48,19],[1,0,1,2],[1,3,1,6],[26,2,26,5],[6,6,6,8],[13,2,13,3],[1,7,1,10],[3,0,3,20],[4,0,4,20],[1,18,1,20],[1,21,1,23],[49,0,49,2],[49,3,49,5],[28,12,28,13],[30,0,30,6],[31,0,43,20],[20,2,20,8],[22,2,22,8],[24,2,24,9],[20,18,20,22],[14,20,14,22],[16,20,16,22],[18,2,18,8],[49,7,49,10],[29,12,29,13],[45,1,48,4]]}
[]
[" Protocollo",null,null,{"$f":"IF(Foglio1!E13=\"\",\"\",Foglio1!E13)","v":""},null,null,null,null,null,null,null,null,null,null,null,null,"Data"]
[]
["ELEMENTI GENERALI CONCERNENTI L'OPERAZIONE CHE SI INTENDE EFFETTUARE"]
["Allegato 2"]
[]
["Impresa Italiana in qualità di:"]
[]
["Informazioni relative al contratto/ordine"]
[null,"Ammontare del presunto contratto:"]
[]
["con regolamento finanziario",null,null,null,null,null,"ai soli fini doganali (sfd)",null,null,null,null,null,null,null,"Solo per l' intermediazione"]
[]
["Importo",null,null,null,null,null,"Importo"]
["Valuta",null,null,null,null,null,"Valuta",null,null,null,null,null,null,null,"Importo di acquisto",null,null,null,null,null,"Valuta"]
[]
["Elementi supplementari",null,null,null,null,null,null,null,null,null,null,null,null,null,"Importo di vendita",null,null,null,null,null,"Valuta"]
[]
[null,null,"Materiale in corso di iscrizione al SERNI",null,null,null,null,null,null,null,null,"Presenza di materiale CLASSIFICATO"]
[]
{"$rows_left_out":33}
{"sheet":"Foglio7","index":7,"n_rows":53,"n_cols":19,"rows_kept":53,"cut":false,"hidden":false,"merged":[[1,1,1,3],[1,16,1,18],[8,1,8,7],[10,1,10,7],[28,1,28,10],[5,1,5,17],[18,9,18,19],[25,9,25,19],[11,7,14,19],[21,11,21,12],[1,13,1,15],[21,16,21,18],[22,7,23,7],[22,9,23,9],[22,6,23,6],[22,8,23,8],[22,1,23,5],[22,10,23,11],[22,12,22,16],[49,1,49,3],[49,4,49,5],[29,9,29,19],[32,1,41,18],[45,1,48,5],[45,9,47,17],[22,17,23,17],[22,18,23,18]]}
[]
[null," Protocollo",null,null,{"$f":"IF(Foglio1!E13=\"\",\"\",Foglio1!E13)","v":""},null,null,null,null,null,null,null,null,"data",null,null,{"$f":"IF(Foglio1!I13=\"\",\"\",Foglio1!I13)","v":""}]
[]
[]
[]
[null,"Elementi aggiuntivi, chiarificatori in merito agli aspetti della trattativa"]
[]
["   Descrizione dell'operazione richiesta"]
[null,"- Descrizione della tipologia del materiale"]
[]
[null,"- Soggetti e ruolo che rivestono nell'operazione"]
[]
[]
[]
[]
[null,"- Indicazione sull'utilizzo finale"]
[]
[null,"- Indicazioni su eventuali trattaive collegate e/o alternative"]
[]
["   Precisare se:"]
{"$rows_left_out":34}
{"sheet":"Legenda","index":8,"n_rows":204,"n_cols":10,"rows_kept":204,"cut":false,"hidden":false,"merged":[[80,0,99,0],[94,4,94,5],[85,2,85,3],[86,2,86,3],[95,4,95,5],[89,4,89,5],[90,4,90,5],[91,4,91,5],[92,4,92,5],[93,4,93,5],[86,4,86,5],[87,4,87,5],[88,4,88,5],[109,1,109,4],[81,4,81,5],[85,4,85,5],[2,1,2,14],[82,4,82,5],[83,4,83,5],[84,4,84,5],[82,2,82,3],[83,2,83,3],[84,2,84,3],[78,3,78,5],[96,4,96,5],[97,4,97,5],[98,4,98,5]]}
[]
[]
[null,"LEGENDA"]
[]
[]
[null,"Legge 185/90 e succ. mod. - Comunicazione di inizio Trattative Contrattuali - 9.2"]
[null,"Legge 185/90 e succ. mod. - Comunicazione di inizio Trattative Contrattuali - 9.4"]
[null,"Legge 185/90 e succ. mod. - Comunicazione di inizio Trattative Contrattuali - 9.5"]
[null,"Legge 185/90 e succ. mod. - Comunicazione di inizio Trattative Contrattuali - 2.6"]
[null,"Legge 185/90 e succ. mod. - Comunicazione di inizio Trattative Contrattuali - Intermediazione"]
[null,"Legge 185/90 e succ. mod. - Richiesta di Variazione Trattative Contrattuali"]
[null,"Legge 185/90 e succ. mod. - Precisazione relativa a Trattativa Contrattuale"]
[null,"Legge 185/90 e succ. mod. - Richiesta di Rinnovo Trattativa Contrattuale"]
[null,"Legge 185/90 e succ. mod. - Richiesta di Autorizzazione alla cessione di informazioni e materiale classificati (Deroga DIS ambito Unione Europea)"]
[]
[]
[]
[null,"9 comma 2",null,null,"EUR",null,null,"AF","AFGANISTAN","AF"]
[null,"9 comma 4",null,null,"GBP",null,null,"AL","ALBANIA","AL"]
[null,null,null,null,"USD",null,null,"DZ","ALGERIA","DZ"]
{"$rows_left_out":184}